Failed to execute goal org.apache.maven.plugins:maven-surefire-plugin:2.22.0 after update ubuntu

After installed updates on ubuntu I have problem with build project.

When I run mvn clean install there are error:

[ERROR] Failed to execute goal org.apache.maven.plugins:maven-surefire-plugin:2.22.0:test (default-test) on project spring-petclinic-customers-service: There are test failures.

[ERROR]

[ERROR] Please refer to /home/sicio/test/spring-petclinic-microservices/spring-petclinic-customers-service/target/surefire-reports for the individual test results.

[ERROR] Please refer to dump files (if any exist) [date]-jvmRun[N].dump, [date].dumpstream and [date]-jvmRun[N].dumpstream.

[ERROR] The forked VM terminated without properly saying goodbye. VM crash or System.exit called?

[ERROR] Command was /bin/sh -c cd /home/sicio/test/spring-petclinic-microservices/spring-petclinic-customers-service && /usr/lib/jvm/java-8-openjdk-amd64/jre/bin/java -jar /home/sicio/test/spring-petclinic-microservices/spring-petclinic-customers-service/target/surefire/surefirebooter1048453915443824886.jar /home/sicio/test/spring-petclinic-microservices/spring-petclinic-customers-service/target/surefire 2018-11-20T21-01-40_588-jvmRun1 surefire6900955508880771947tmp surefire_0182883786028713736tmp

[ERROR] Error occurred in starting fork, check output in log

[ERROR]...

Read More »

By: StackOverFlow - Tuesday, 20 November

Related Posts